{"text_format":"1","workbook":"xlsx","n_sheets":8,"sheets":["Instructions","Scenario Data","Alternative Calibration","SRC & Scaling Factors","Extrapolation","2020 Review Term Structures","RfrAltConfig","Shocks"],"not_rendered":{"charts":7,"images":2,"macros":1,"external_links":1,"defined_names":62,"comments":0,"pivot_tables":0},"unopened":[],"bounds":{"document_bytes":16777216,"sheet_cells":100000,"rows_first":2000,"rows_last":500,"rows_between":2000,"halvings":0,"cell_chars":16384,"cell_head_chars":4096},"cells_cut":0,"cells_raw":0,"read":"whole","date_system":"1900"}

{"sheet":"Instructions","index":0,"n_rows":34,"n_cols":9,"rows_kept":34,"cut":false,"hidden":false,"merged":[]}
[]
[]
[]
[]
[]
[]
[null,"This workbook sets out amended risk-free interest rate term structures:"]
[]
[null,"Worksheet \"Scenario Data\""]
[null,"Scenario 1: CP interest rate risk shocks based on LLP 20Y"]
[null,"Scenario 2: Current SCR interest rate risk shocks"]
[]
[null,"Worksheet \"Alternative Calibration\""]
[null,"Alternative Calibration 1: Like scenario 1, but with a constant floor at -1.25% for the down shock"]
[null,"Alternative Calibration 2: Like scenario 1, but alternative shocks in case the FSP is less than 15Y"]
{"$rows_left_out":20}
{"sheet":"Scenario Data","index":1,"n_rows":162,"n_cols":26,"rows_kept":162,"cut":false,"hidden":false,"merged":[[5,9,5,10],[6,9,6,10],[10,1,10,5],[10,7,10,11]]}
[]
[]
[]
[]
[]
[null,null,null,null,null,null,null,null,null,"EUR"]
[null,null,null,null,null,null,null,null,null,15]
[]
[]
[]
[null,"NO volatility adjustment",null,null,null,null,null,"WITH volatility adjustment"]
[null,"Alternative Extrapolation Method RFR","Scenario 1- Up Shock","Scenario 1 - Down Shock","Scenario 2 - Up Shock","Scenario 2 - Down Shock",null,"Alternative Extrapolation Method RFR","Scenario 1 - Up Shock","Scenario 1 - Down Shock","Scenario 2 - Up Shock","Scenario 2 - Down Shock"]
[1,{"$f":"BaseCurve","v":-4.1609999999998593E-3},{"$f":"ROUND(B13*(1+Shocks!H12)+Shocks!I12,5)","v":1.47E-2},{"$f":"ROUND(B13*(1-Shocks!F12)-Shocks!G12,5)","v":-1.3350000000000001E-2},{"$f":"ROUND(B13 + MAX(0.01,Shocks!E12*ABS(B13) ),5)","v":5.8399999999999997E-3},{"$f":"ROUND(IF(B13<0,B13, B13 - Shocks!D12 * ABS(B13)),5)","v":-4.1599999999999996E-3},null,{"$f":"BaseCurveWithVA","v":-2.6672414999997507E-3},{"$f":"ROUND(B13*(1+Shocks!H12)+Shocks!I12,5)+Extrapolation!T15","v":1.6193758500000106E-2},{"$f":"ROUND(B13*(1-Shocks!F12)-Shocks!G12,5)+Extrapolation!T15","v":-1.1856241499999892E-2},{"$f":"ROUND(B13 + MAX(0.01,Shocks!E12*ABS(B13) )+Extrapolation!T15, 5)","v":7.3299999999999997E-3},{"$f":"ROUND(IF(B13<0,B13, B13 - Shocks!D12 * ABS(B13))+Extrapolation!T15, 5)","v":-2.6700000000000001E-3},null,null,null,null,null,null,null,null,null,null,null,null,"Czech Republic",1]
[2,-3.9354447556139149E-3,{"$f":"ROUND(B14*(1+Shocks!H13)+Shocks!I13,5)","v":1.2579999999999999E-2},{"$f":"ROUND(B14*(1-Shocks!F13)-Shocks!G13,5)","v":-1.183E-2},{"$f":"ROUND(B14 + MAX(0.01,Shocks!E13*ABS(B14) ),5)","v":6.0600000000000003E-3},{"$f":"ROUND(IF(B14<0,B14, B14 - Shocks!D13 * ABS(B14)),5)","v":-3.9399999999999999E-3},null,-2.4413479227473056E-3,{"$f":"ROUND(B14*(1+Shocks!H13)+Shocks!I13,5)+Extrapolation!T16","v":1.4074096832866608E-2},{"$f":"ROUND(B14*(1-Shocks!F13)-Shocks!G13,5)+Extrapolation!T16","v":-1.0335903167133391E-2},{"$f":"ROUND(B14 + MAX(0.01,Shocks!E13*ABS(B14) )+Extrapolation!T16, 5)","v":7.5599999999999999E-3},{"$f":"ROUND(IF(B14<0,B14, B14 - Shocks!D13 * ABS(B14))+Extrapolation!T16, 5)","v":-2.4399999999999999E-3},null,null,null,null,null,null,null,null,null,null,null,null,"Hungary",2]
[3,-3.3821302804601938E-3,{"$f":"ROUND(B15*(1+Shocks!H14)+Shocks!I14,5)","v":1.2160000000000001E-2},{"$f":"ROUND(B15*(1-Shocks!F14)-Shocks!G14,5)","v":-1.0189999999999999E-2},{"$f":"ROUND(B15 + MAX(0.01,Shocks!E14*ABS(B15) ),5)","v":6.62E-3},{"$f":"ROUND(IF(B15<0,B15, B15 - Shocks!D14 * ABS(B15)),5)","v":-3.3800000000000002E-3},null,-1.8872034758807832E-3,{"$f":"ROUND(B15*(1+Shocks!H14)+Shocks!I14,5)+Extrapolation!T17","v":1.3654926804579411E-2},{"$f":"ROUND(B15*(1-Shocks!F14)-Shocks!G14,5)+Extrapolation!T17","v":-8.6950731954205888E-3},{"$f":"ROUND(B15 + MAX(0.01,Shocks!E14*ABS(B15) )+Extrapolation!T17, 5)","v":8.1099999999999992E-3},{"$f":"ROUND(IF(B15<0,B15, B15 - Shocks!D14 * ABS(B15))+Extrapolation!T17, 5)","v":-1.89E-3},null,null,null,null,null,null,null,null,null,null,null,null,"Poland",3]
{"$rows_left_out":148}
{"sheet":"Alternative Calibration","index":2,"n_rows":162,"n_cols":26,"rows_kept":162,"cut":false,"hidden":false,"merged":[[5,9,5,10],[6,9,6,10],[10,1,10,5],[10,7,10,11]]}
[]
[]
[]
[]
[]
[null,null,null,null,null,null,null,null,null,{"$f":"'Scenario Data'!J6","v":"EUR"}]
[null,null,null,null,null,null,null,null,null,{"$f":"'Scenario Data'!J7","v":15}]
[]
[]
[]
[null,"NO volatility adjustment",null,null,null,null,null,"WITH volatility adjustment"]
[null,"Alternative Extrapolation Method RFR","Alternative Calibration 1 - Up Shock","Alternative Calibration 1 - Down Shock","Alternative Calibration 2 - Up Shock","Alternative Calibration 2 - Down Shock",null,"Alternative Extrapolation Method RFR","Alternative Calibration 1 - Up Shock","Alternative Calibration 1 - Down Shock","Alternative Calibration 2 - Up Shock","Alternative Calibration 2 - Down Shock"]
[1,{"$f":"BaseCurve","v":-4.1609999999998593E-3},{"$f":"ROUND(B13*(1+Shocks!H12)+Shocks!I12,5)","v":1.47E-2},{"$f":"MAX(ROUND(B13*(1-Shocks!F12)-Shocks!G12,5), -1.25%)","v":-1.2500000000000001E-2},{"$f":"IF(Extrapolation!FSP >= 15, ROUND(B13*(1+Shocks!H12)+Shocks!I12,5), ROUND(B13*(1+Shocks!L12)+Shocks!M12,5))","v":1.47E-2},{"$f":"IF(Extrapolation!FSP >= 15, ROUND(B13*(1-Shocks!F12)-Shocks!G12,5),  ROUND(B13*(1-Shocks!J12)-Shocks!K12,5))","v":-1.3350000000000001E-2},null,{"$f":"BaseCurveWithVA","v":-2.6672414999997507E-3},{"$f":"ROUND(B13*(1+Shocks!H12)+Shocks!I12,5)+Extrapolation!T15","v":1.6193758500000106E-2},{"$f":"MAX(ROUND(B13*(1-Shocks!F12)-Shocks!G12,5)+Extrapolation!T15, -1.25%)","v":-1.1856241499999892E-2},{"$f":"IF(Extrapolation!FSP >= 15, ROUND(B13*(1+Shocks!H12)+Shocks!I12 + Extrapolation!T15, 5), ROUND(B13*(1+Shocks!L12)+Shocks!M12 + Extrapolation!T15,5))","v":1.619E-2},{"$f":"IF(Extrapolation!FSP >= 15, ROUND(B13*(1-Shocks!F12)-Shocks!G12+Extrapolation!T15, 5), ROUND(B13*(1-Shocks!J12)-Shocks!K12+Extrapolation!T15, 5))","v":-1.1849999999999999E-2},null,null,null,null,null,null,null,null,null,null,null,null,"Czech Republic",1]
[2,-3.9354447556139149E-3,{"$f":"ROUND(B14*(1+Shocks!H13)+Shocks!I13,5)","v":1.2579999999999999E-2},{"$f":"MAX(ROUND(B14*(1-Shocks!F13)-Shocks!G13,5), -1.25%)","v":-1.183E-2},{"$f":"IF(Extrapolation!FSP >= 15, ROUND(B14*(1+Shocks!H13)+Shocks!I13,5), ROUND(B14*(1+Shocks!L13)+Shocks!M13,5))","v":1.2579999999999999E-2},{"$f":"IF(Extrapolation!FSP >= 15, ROUND(B14*(1-Shocks!F13)-Shocks!G13,5),  ROUND(B14*(1-Shocks!J13)-Shocks!K13,5))","v":-1.183E-2},null,-2.4413479227473056E-3,{"$f":"ROUND(B14*(1+Shocks!H13)+Shocks!I13,5)+Extrapolation!T16","v":1.4074096832866608E-2},{"$f":"MAX(ROUND(B14*(1-Shocks!F13)-Shocks!G13,5)+Extrapolation!T16, -1.25%)","v":-1.0335903167133391E-2},{"$f":"IF(Extrapolation!FSP >= 15, ROUND(B14*(1+Shocks!H13)+Shocks!I13 + Extrapolation!T16, 5), ROUND(B14*(1+Shocks!L13)+Shocks!M13 + Extrapolation!T16,5))","v":1.4069999999999999E-2},{"$f":"IF(Extrapolation!FSP >= 15, ROUND(B14*(1-Shocks!F13)-Shocks!G13+Extrapolation!T16, 5), ROUND(B14*(1-Shocks!J13)-Shocks!K13+Extrapolation!T16, 5))","v":-1.0330000000000001E-2},null,null,null,null,null,null,null,null,null,null,null,null,"Hungary",2]
[3,-3.3821302804601938E-3,{"$f":"ROUND(B15*(1+Shocks!H14)+Shocks!I14,5)","v":1.2160000000000001E-2},{"$f":"MAX(ROUND(B15*(1-Shocks!F14)-Shocks!G14,5), -1.25%)","v":-1.0189999999999999E-2},{"$f":"IF(Extrapolation!FSP >= 15, ROUND(B15*(1+Shocks!H14)+Shocks!I14,5), ROUND(B15*(1+Shocks!L14)+Shocks!M14,5))","v":1.2160000000000001E-2},{"$f":"IF(Extrapolation!FSP >= 15, ROUND(B15*(1-Shocks!F14)-Shocks!G14,5),  ROUND(B15*(1-Shocks!J14)-Shocks!K14,5))","v":-1.0189999999999999E-2},null,-1.8872034758807832E-3,{"$f":"ROUND(B15*(1+Shocks!H14)+Shocks!I14,5)+Extrapolation!T17","v":1.3654926804579411E-2},{"$f":"MAX(ROUND(B15*(1-Shocks!F14)-Shocks!G14,5)+Extrapolation!T17, -1.25%)","v":-8.6950731954205888E-3},{"$f":"IF(Extrapolation!FSP >= 15, ROUND(B15*(1+Shocks!H14)+Shocks!I14 + Extrapolation!T17, 5), ROUND(B15*(1+Shocks!L14)+Shocks!M14 + Extrapolation!T17,5))","v":1.366E-2},{"$f":"IF(Extrapolation!FSP >= 15, ROUND(B15*(1-Shocks!F14)-Shocks!G14+Extrapolation!T17, 5), ROUND(B15*(1-Shocks!J14)-Shocks!K14+Extrapolation!T17, 5))","v":-8.6999999999999994E-3},null,null,null,null,null,null,null,null,null,null,null,null,"Poland",3]
{"$rows_left_out":148}
{"sheet":"SRC & Scaling Factors","index":3,"n_rows":26,"n_cols":4,"rows_kept":26,"cut":false,"hidden":false,"merged":[]}
[]
[]
[]
[]
[]
[]
[]
[]
[null,"Currency","Risk corrected currency spread","Scaling factor"]
[null,"AUD",1.4207352527929465E-3,2.1231422505307855]
[null,"BGN",1.0759776410328261E-3,2.4937655860349128]
[null,"CAD",3.6284921391769231E-3,1.5360983102918586]
[null,"CHF",6.9579141562351517E-4,1.6366612111292962]
[null,"CZK",1.6979047983093165E-3,1.4947683109118086]
[null,"DKK",2.4620060522620967E-3,1.4598540145985404]
{"$rows_left_out":12}
{"sheet":"Extrapolation","index":4,"n_rows":164,"n_cols":20,"rows_kept":164,"cut":false,"hidden":true,"merged":[[11,12,11,13],[2,16,2,17]]}
[]
[null,"inputs",null,"Alternative Extrapolation with VA - Derived from situation without VA"]
[null,"outputs",null,"based on alternvative extrapolations from worksheet 2020 Review Term Structures",null,null,null,null,null,null,null,null,null,null,null,"Currency",{"$f":"'Scenario Data'!$J$6","v":"EUR"}]
[null,null,null,null,null,{"$f":"MATCH(Q3,L.ISO4217,0)","v":1}]
[]
[null,null,null,null,null,null,null,null,null,null,null,null,null,null,null,"Alternative Extrapolation with VA"]
[null,null,null,null,"FSP",{"$f":"INDEX(tblRfrAltConfig[FSP],index)","v":20}]
[null,null,null,null,"UFR",{"$f":"INDEX(tblRfrAltConfig[UFR],index)/100","v":3.9E-2}]
[null,null,null,null,"MeanReversion",{"$f":"IF(Q3=\"SEK\",40%,10%)","v":0.1},null,null,null,null,null,null,null,null,null,"First weight",{"$f":"INDEX(LLFRweights,FSP)","v":0.33}]
[null,null,null,null,"VA",{"$f":"'Scenario Data'!J7","v":15},"bp AC",null,null,null,null,null,null,null,null,"First fw LLFR",{"$f":"GetFirstFwLLFR($I$15:$I$64,DLT,LLFRweights)","v":9.2155608925984876E-3}]
[null,null,null,null,"LLFR",{"$f":"INDEX(TermStructuresLLFR,,2*index)","v":7.0513690149732423E-3},null,null,null,null,null,null,null,null,null,"LLFRVA",{"$f":"Q9*(Q10+LN(1+VA/10000))+(LLFR-Q9*Q10)","v":7.545998135806105E-3}]
[null,null,null,null,null,null,null,null,null,null,null,null,"+ VA up to FSP"]
[null,"Tenor","DLT","LLFRweights","Tenor","Zero AC",null,"Tenor","Zero CC","1YFw CC",null,"Tenor","Zero CC","1YFw CC",null,"Tenor","Zero+VA AC","1YFw+VA AC","Discount","VA"]
[null,null,null,null,0,null,null,0,null,null,null,0,null,null,null,0,null,null,1]
[null,1,{"$f":"INDEX(INDIRECT(\"tblRfrAltConfig[DLT\"&B15&\"]\"),index)","v":1},{"$f":"INDEX(INDIRECT(\"tblWeightsLLFR[\"&B15&\"]\"),index)","v":0},1,{"$f":"INDEX(TermStructures,,2*index)","v":-4.1609999999998593E-3},null,1,{"$f":"LN(1+F15)","v":-4.1696810501015893E-3},{"$f":"$H15*I15-$H14*I14","v":-4.1696810501015893E-3},null,1,{"$f":"AVERAGE(N$15:N15)","v":-2.6708049263656406E-3},{"$f":"J15+($L15<=FSP)*LN(1+VA/10000)","v":-2.6708049263656406E-3},null,1,{"$f":"AlternativeExtrapolation($M$15:$M$164,FSP,UFR,$Q$11,MeanReversion,\"A\")","v":-2.6672414999997507E-3},-2.6672414999997507E-3,1.0026743747031948,{"$f":"Q15-F15","v":1.4937585000001086E-3}]
{"$rows_left_out":150}
{"sheet":"2020 Review Term Structures","index":5,"n_rows":173,"n_cols":70,"rows_kept":173,"cut":false,"hidden":true,"merged":[[21,58,21,59],[21,60,21,61],[21,62,21,63],[21,64,21,65],[21,66,21,67],[21,68,21,69],[21,46,21,47],[21,48,21,49],[21,50,21,51],[21,52,21,53],[21,54,21,55],[21,56,21,57],[21,36,21,37],[21,38,21,39],[21,40,21,41],[21,42,21,43],[21,44,21,45],[21,26,21,27],[21,28,21,29],[21,30,21,31],[21,32,21,33],[21,20,21,21],[21,22,21,23],[21,24,21,25],[21,16,21,17],[21,12,21,13],[21,14,21,15],[21,8,21,9],[21,10,21,11],[21,34,21,35],[21,2,21,3],[21,4,21,5],[21,6,21,7],[7,58,7,59],[7,60,7,61],[7,62,7,63],[7,64,7,65],[7,26,7,27],[7,28,7,29],[7,30,7,31],[7,32,7,33],[7,18,7,19],[7,20,7,21],[7,22,7,23],[7,24,7,25],[7,16,7,17],[7,12,7,13],[7,14,7,15],[7,8,7,9],[7,10,7,11],[7,2,7,3],[7,4,7,5],[7,6,7,7],[21,18,21,19],[7,66,7,67],[7,68,7,69],[7,46,7,47],[7,48,7,49],[7,50,7,51],[7,52,7,53],[7,54,7,55],[7,56,7,57],[7,34,7,35],[7,36,7,37],[7,38,7,39],[7,40,7,41],[7,42,7,43],[7,44,7,45],[6,58,6,59],[6,60,6,61],[6,62,6,63],[6,64,6,65],[6,66,6,67],[6,68,6,69],[6,46,6,47],[6,48,6,49],[6,50,6,51],[6,52,6,53],[6,54,6,55],[6,56,6,57],[6,34,6,35],[6,36,6,37],[6,38,6,39],[6,40,6,41],[6,42,6,43],[6,44,6,45],[6,26,6,27],[6,28,6,29],[6,30,6,31],[6,32,6,33],[6,20,6,21],[6,22,6,23],[6,24,6,25],[6,16,6,17],[6,8,6,9],[6,10,6,11],[6,18,6,19],[6,2,6,3],[6,4,6,5],[6,6,6,7],[6,12,6,13],[6,14,6,15]]}
["RFR Term Structures as of end of December 2019"]
[" Alternative Extrapolation - Without VA"]
["All source data are Refinitiv based"]
[]
[null,null,"Country","Currency","Country","Currency","Country","Currency","Country","Currency","Country","Currency","Country","Currency","Country","Currency","Country","Currency","Country","Currency","Country","Currency","Country","Currency","Country","Currency","Country","Currency","Country","Currency","Country","Currency","Country","Currency","Country","Currency","Country","Currency","Country","Currency","Country","Currency","Country","Currency","Country","Currency","Country","Currency","Country","Currency","Country","Currency","Country","Currency","Country","Currency","Country","Currency","Country","Currency","Country","Currency","Country","Currency","Country","Currency","Country","Currency","Country","Currency"]
[null,null,"Euro","EUR","Bulgaria","BGN","Croatia","HRK","Czechia","CZK","Denmark","DKK","Hungary","HUF","Iceland","ISK","Liechtenstein","CHF","Norway","NOK","Poland","PLN","Romania","RON","Russia","RUB","Sweden","SEK","Switzerland","CHF","United Kingdom","GBP","Australia","AUD","Brazil","BRL","Canada","CAD","Chile","CLP","China","CNY","Colombia","COP","Hong Kong","HKD","India","INR","Japan","JPY","Malaysia","MYR","Mexico","MXN","New Zealand","NZD","Singapore","SGD","South Africa","ZAR","South Korea","KRW","Taiwan","TWD","Thailand","THB","Turkey","TRY","United States","USD"]
[null,null,"Date",null,"Date",null,"Date",null,"Date",null,"Date",null,"Date",null,"Date",null,"Date",null,"Date",null,"Date",null,"Date",null,"Date",null,"Date",null,"Date",null,"Date",null,"Date",null,"Date",null,"Date",null,"Date",null,"Date",null,"Date",null,"Date",null,"Date",null,"Date",null,"Date",null,"Date",null,"Date",null,"Date",null,"Date",null,"Date",null,"Date",null,"Date",null,"Date",null,"Date"]
[null,null,"2019-12-31",null,"2019-12-31",null,"2019-12-30",null,"2019-12-31",null,"2019-12-31",null,"2019-12-30",null,"2019-12-30",null,"2019-12-31",null,"2019-12-31",null,"2019-12-30",null,"2019-12-30",null,"2019-12-30",null,"2019-12-31",null,"2019-12-31",null,"2019-12-31",null,"2019-12-31",null,"2019-12-30",null,"2019-12-31",null,"2019-12-30",null,"2019-12-31",null,"2019-12-30",null,"2019-12-31",null,"2019-12-31",null,"2019-12-31",null,"2019-12-31",null,"2019-12-31",null,"2019-12-31",null,"2019-12-31",null,"2019-12-31",null,"2019-12-31",null,"2019-12-31",null,"2019-12-30",null,"2019-12-31",null,"2019-12-31"]
[null,null,"CRA","UFR","CRA","UFR","CRA","UFR","CRA","UFR","CRA","UFR","CRA","UFR","CRA","UFR","CRA","UFR","CRA","UFR","CRA","UFR","CRA","UFR","CRA","UFR","CRA","UFR","CRA","UFR","CRA","UFR","CRA","UFR","CRA","UFR","CRA","UFR","CRA","UFR","CRA","UFR","CRA","UFR","CRA","UFR","CRA","UFR","CRA","UFR","CRA","UFR","CRA","UFR","CRA","UFR","CRA","UFR","CRA","UFR","CRA","UFR","CRA","UFR","CRA","UFR","CRA","UFR","CRA","UFR"]
[null,null,10,3.9,15,3.9,10,3.9,10,3.9,11,3.9,10,4.5,10,3.9,10,2.9,10,3.9,10,3.9,10,3.9,35,4.5,10,3.9,10,2.9,11,3.9,21,3.9,35,5.5,15,3.9,17,4.5,22,4.5,35,4.5,15,3.9,35,5.5,10,3.5000000000000004,15,3.9,35,4.9000000000000004,11,3.9,11,3.9,35,5.5,10,3.9,10,3.9,10,3.9,35,5.5,13,3.9]
[null,null,null,"Alternative",null,"Alternative",null,"Alternative",null,"Alternative",null,"Alternative",null,"Alternative",null,"Alternative",null,"Alternative",null,"Alternative",null,"Alternative",null,"Alternative",null,"Alternative",null,"Alternative",null,"Alternative",null,"Alternative",null,"Alternative",null,"Alternative",null,"Alternative",null,"Alternative",null,"Alternative",null,"Alternative",null,"Alternative",null,"Alternative",null,"Alternative",null,"Alternative",null,"Alternative",null,"Alternative",null,"Alternative",null,"Alternative",null,"Alternative",null,"Alternative",null,"Alternative",null,"Alternative",null,"Alternative"]
[null,null,null,"Instrument",null,"Instrument",null,"Instrument",null,"Instrument",null,"Instrument",null,"Instrument",null,"Instrument",null,"Instrument",null,"Instrument",null,"Instrument",null,"Instrument",null,"Instrument",null,"Instrument",null,"Instrument",null,"Instrument",null,"Instrument",null,"Instrument",null,"Instrument",null,"Instrument",null,"Instrument",null,"Instrument",null,"Instrument",null,"Instrument",null,"Instrument",null,"Instrument",null,"Instrument",null,"Instrument",null,"Instrument",null,"Instrument",null,"Instrument",null,"Instrument",null,"Instrument",null,"Instrument",null,"Instrument"]
[null,null,null,"SWP",null,"SWP",null,"GVT",null,"SWP",null,"SWP",null,"SWP",null,"GVT",null,"SWP",null,"SWP",null,"SWP",null,"GVT",null,"GVT",null,"SWP",null,"SWP",null,"SWP",null,"SWP",null,"GVT",null,"SWP",null,"GVT",null,"SWP",null,"GVT",null,"SWP",null,"GVT",null,"SWP",null,"GVT",null,"SWP",null,"SWP",null,"SWP",null,"SWP",null,"SWP",null,"GVT",null,"GVT",null,"GVT",null,"SWP"]
[null,null,null,"CouponFreq",null,"CouponFreq",null,"CouponFreq",null,"CouponFreq",null,"CouponFreq",null,"CouponFreq",null,"CouponFreq",null,"CouponFreq",null,"CouponFreq",null,"CouponFreq",null,"CouponFreq",null,"CouponFreq",null,"CouponFreq",null,"CouponFreq",null,"CouponFreq",null,"CouponFreq",null,"CouponFreq",null,"CouponFreq",null,"CouponFreq",null,"CouponFreq",null,"CouponFreq",null,"CouponFreq",null,"CouponFreq",null,"CouponFreq",null,"CouponFreq",null,"CouponFreq",null,"CouponFreq",null,"CouponFreq",null,"CouponFreq",null,"CouponFreq",null,"CouponFreq",null,"CouponFreq",null,"CouponFreq",null,"CouponFreq"]
[null,null,null,1,null,1,null,0,null,1,null,1,null,1,null,0,null,1,null,1,null,1,null,0,null,0,null,1,null,1,null,2,null,2,null,0,null,2,null,0,null,4,null,0,null,4,null,0,null,2,null,0,null,13,null,2,null,2,null,4,null,4,null,0,null,0,null,0,null,2]
{"$rows_left_out":159}
{"sheet":"RfrAltConfig","index":6,"n_rows":113,"n_cols":59,"rows_kept":113,"cut":false,"hidden":true,"merged":[]}
[]
[null,"The DLT points for the alternative extrapolation method define the tenors for which input rates should be observed from Refinitiv."]
[null,"For DLT tenors starting at the FSP-tenor up to and including the LLP-tenor there is a separte table of weights to determine the LLFR below the first table."]
[]
[null,"Country","Order","ISO4217","Instrument","CouponFreq","FSP","LLP","UFR","DLT1","DLT2","DLT3","DLT4","DLT5","DLT6","DLT7","DLT8","DLT9","DLT10","DLT11","DLT12","DLT13","DLT14","DLT15","DLT16","DLT17","DLT18","DLT19","DLT20","DLT21","DLT22","DLT23","DLT24","DLT25","DLT26","DLT27","DLT28","DLT29","DLT30","DLT31","DLT32","DLT33","DLT34","DLT35","DLT36","DLT37","DLT38","DLT39","DLT40","DLT41","DLT42","DLT43","DLT44","DLT45","DLT46","DLT47","DLT48","DLT49","DLT50"]
[null,"Euro",1,"EUR","SWP",1,20,50,3.9,1,1,1,1,1,1,1,1,1,1,1,1,1,1,1,0,0,0,0,1,0,0,0,0,1,0,0,0,0,1,0,0,0,0,0,0,0,0,0,1,0,0,0,0,0,0,0,0,0,1]
[null,"Bulgaria",2,"BGN","SWP",1,20,20,3.9,1,1,1,1,1,1,1,1,1,1,1,1,1,1,1,0,0,0,0,1,0,0,0,0,0,0,0,0,0,0,0,0,0,0,0,0,0,0,0,0,0,0,0,0,0,0,0,0,0,0]
[null,"Croatia",3,"HRK","GVT",0,12,12,3.9,1,1,1,1,1,1,1,1,1,1,1,1,0,0,0,0,0,0,0,0,0,0,0,0,0,0,0,0,0,0,0,0,0,0,0,0,0,0,0,0,0,0,0,0,0,0,0,0,0,0]
[null,"Czech Republic",4,"CZK","SWP",1,10,10,3.9,1,1,0,0,1,0,0,0,0,1,0,0,0,0,0,0,0,0,0,0,0,0,0,0,0,0,0,0,0,0,0,0,0,0,0,0,0,0,0,0,0,0,0,0,0,0,0,0,0,0]
[null,"Denmark",5,"DKK","SWP",1,20,20,3.9,1,1,1,1,1,1,1,1,1,1,1,1,1,1,1,0,0,0,0,1,0,0,0,0,0,0,0,0,0,0,0,0,0,0,0,0,0,0,0,0,0,0,0,0,0,0,0,0,0,0]
[null,"Hungary",6,"HUF","SWP",1,10,10,4.5,1,1,1,0,1,0,0,0,0,1,0,0,0,0,0,0,0,0,0,0,0,0,0,0,0,0,0,0,0,0,0,0,0,0,0,0,0,0,0,0,0,0,0,0,0,0,0,0,0,0]
[null,"Iceland",7,"ISK","GVT",0,8,8,3.9,0,1,1,0,0,1,0,1,0,0,0,0,0,0,0,0,0,0,0,0,0,0,0,0,0,0,0,0,0,0,0,0,0,0,0,0,0,0,0,0,0,0,0,0,0,0,0,0,0,0]
[null,"Liechtenstein",8,"CHF","SWP",1,10,10,2.9,1,1,0,0,1,0,0,0,0,1,0,0,0,0,0,0,0,0,0,0,0,0,0,0,0,0,0,0,0,0,0,0,0,0,0,0,0,0,0,0,0,0,0,0,0,0,0,0,0,0]
[null,"Norway",9,"NOK","SWP",1,10,10,3.9,1,1,1,1,1,0,0,0,0,1,0,0,0,0,0,0,0,0,0,0,0,0,0,0,0,0,0,0,0,0,0,0,0,0,0,0,0,0,0,0,0,0,0,0,0,0,0,0,0,0]
[null,"Poland",10,"PLN","SWP",1,10,10,3.9,1,1,0,0,1,0,0,0,0,1,0,0,0,0,0,0,0,0,0,0,0,0,0,0,0,0,0,0,0,0,0,0,0,0,0,0,0,0,0,0,0,0,0,0,0,0,0,0,0,0]
{"$rows_left_out":99}
{"sheet":"Shocks","index":7,"n_rows":161,"n_cols":13,"rows_kept":161,"cut":false,"hidden":true,"merged":[[8,5,8,8],[8,9,8,12]]}
[]
[]
[null,"Standard calculation of the Solvency Capital Requirement"]
[]
[]
[null,"Interest rate risk submodule"]
[]
[]
[null,null,null,"Current SCR Shocks",null,"CP Scenario 1 Shocks",null,null,null,"Shocks until 10Y"]
[null,null,null,"Down Shock","Up Shock","smdown","bmdown ","smup","bmup","smdown","bmdown ","smup","bmup"]
[]
[null,1,null,0.75,0.7,0.57999999999999996,1.1599999999999999E-2,0.61,2.1399999999999999E-2,0.57999999999999996,1.1599999999999999E-2,0.61,2.1399999999999999E-2]
[null,2,null,0.65,0.7,0.51,9.9000000000000008E-3,0.53,1.8599999999999998E-2,0.51,9.9000000000000008E-3,0.53,1.8599999999999998E-2]
[null,3,null,0.56000000000000005,0.64,0.44,8.3000000000000001E-3,0.49,1.72E-2,0.44,8.3000000000000001E-3,0.49,1.72E-2]
[null,4,null,0.5,0.59,0.4,7.4000000000000003E-3,0.46,1.61E-2,0.4,7.4000000000000003E-3,0.46,1.61E-2]
{"$rows_left_out":146}