{"text_format":"1","workbook":"xlsx","n_sheets":8,"sheets":["Introduction","Dashboard","Historical Protection gap","Exposure_Hazard","Vulnerability","Insurance coverage","GDP","Country area"],"not_rendered":{"charts":0,"images":0,"macros":1,"external_links":0,"defined_names":3,"comments":0,"pivot_tables":0},"unopened":[],"bounds":{"document_bytes":16777216,"sheet_cells":100000,"rows_first":2000,"rows_last":500,"rows_between":2000,"halvings":0,"cell_chars":16384,"cell_head_chars":4096},"cells_cut":0,"cells_raw":0,"read":"whole","date_system":"1900"}

{"sheet":"Introduction","index":0,"n_rows":33,"n_cols":3,"rows_kept":33,"cut":false,"hidden":false,"merged":[[32,1,32,7]]}
["INTRODUCTION"]
[]
[]
[null,"Pilot dashboard on protection gap for natural catatrophes*"]
[]
[null,"Measure of the protection gap in Europe:"]
[null,"- historical protection gap: based on differences observed between economic and insured historical losses"]
[null,"- estimate of today's protection gap: derived by combining the hazard, vulnerability, exposure and insurance coverage"]
[]
[null,"2 views:"]
[]
[null,"-Dashboard "]
[null,"Tab \"Dashboard\""]
[]
[null,"2. Statistics"]
{"$rows_left_out":19}
{"sheet":"Dashboard","index":1,"n_rows":37,"n_cols":34,"rows_kept":37,"cut":false,"hidden":false,"merged":[[3,4,3,9],[3,11,3,16],[3,18,3,23],[3,25,3,30],[3,1,3,2]]}
["DASHBOARD"]
[]
[null,"Historical Protection gap","Estimate of protection gap today",null,"Historical Protection gap",null,"Estimate of protection gap today","Exposure to hazard","Vulnerability","Insurance coverage",null,"Historical Protection gap",null,"Estimate of protection gap today","Exposure to hazard","Vulnerability","Insurance coverage",null,"Historical Protection gap",null,"Estimate of protection gap today","Exposure to hazard","Vulnerability","Insurance coverage",null,"Historical Protection gap",null,"Estimate of protection gap today","Exposure to hazard","Vulnerability","Insurance coverage"]
["COUNTRY","All Peril",null,null,"Earthquake",null,null,null,null,null,null," Flood",null,null,null,null,null,null,"Wildfire",null,null,null,null,null,null,"Windstorm"]
["EU",{"$f":"MROUND((Z5+S5+L5+E5)/4,0.1)","v":1.4000000000000001},{"$f":"MROUND((AB5+U5+N5+G5)/4,1)","v":1},null,{"$f":"MROUND(AVERAGE(E6:E35),0.1)","v":0.9},null,{"$f":"MROUND(AVERAGE(G6:G35),1)","v":1},{"$f":"MROUND(AVERAGE(H6:H35),1)","v":1},{"$f":"MROUND(AVERAGE(I6:I35),1)","v":4},{"$f":"MROUND(AVERAGE(J6:J35),1)","v":3},null,{"$f":"MROUND(AVERAGE(L6:L35),0.1)","v":1.5},null,{"$f":"MROUND(AVERAGE(N6:N35),1)","v":1},{"$f":"MROUND(AVERAGE(O6:O35),1)","v":2},"n/a",{"$f":"MROUND(AVERAGE(Q6:Q35),1)","v":2},null,{"$f":"MROUND(AVERAGE(S6:S35),0.1)","v":1.7000000000000002},null,{"$f":"MROUND(AVERAGE(U6:U35),0.1)","v":1.6},{"$f":"MROUND(AVERAGE(V6:V35),1)","v":2},"n/a",{"$f":"MROUND(AVERAGE(X6:X35),1)","v":3},null,{"$f":"MROUND(AVERAGE(Z6:Z35),0.1)","v":1.4000000000000001},null,{"$f":"MROUND(AVERAGE(AB6:AB35),1)","v":1},{"$f":"MROUND(AVERAGE(AC6:AC35),1)","v":2},{"$f":"MROUND(AVERAGE(AD6:AD35),1)","v":2},{"$f":"MROUND(AVERAGE(AE6:AE35),1)","v":1}]
["Austria",{"$f":"MROUND((Z6+S6+L6+E6)/4,0.1)","v":1.5},{"$f":"MROUND((AB6+U6+N6+G6)/4,0.1)","v":2},null,{"$f":"VLOOKUP(A6,'Historical Protection gap'!$A$17:$AC$47,8,FALSE)","v":0},null,{"$f":"IF((AND(ISNUMBER(I6),ISNUMBER(J6))),MROUND((H6)^(1.5/3)*I6^(0.5/3)*J6^(1/3),0.1),IF(ISNUMBER(I6),MROUND((H6)^(1.5/2)*I6^(0.5/2),0.1),MROUND((H6)^(1.5/2.5)*J6^(1/2.5),0.1)))","v":1.8},{"$f":"IFERROR(VLOOKUP(A6,Exposure_Hazard!B$17:Q$47,7,FALSE),\"n/a\")","v":1},{"$f":"IFERROR(VLOOKUP(A6,Vulnerability!A$17:F$47,6,FALSE),\"n/a\")","v":4},{"$f":"IFERROR(VLOOKUP(A6,'Insurance coverage'!B$18:AD$47,7,FALSE),\"n/a\")","v":3},null,{"$f":"VLOOKUP(A6,'Historical Protection gap'!$A$17:$AC$47,15,FALSE)","v":2},null,{"$f":"IF((AND(ISNUMBER(P6),ISNUMBER(Q6))),MROUND((O6)^(1.5/3)*P6^(0.5/3)*Q6^(1/3),0.1),IF(ISNUMBER(P6),MROUND((O6)^(1.5/2)*P6^(0.5/2),0.1),MROUND((O6)^(1.5/2.5)*Q6^(1/2.5),0.1)))","v":3.4000000000000004},{"$f":"IFERROR(VLOOKUP(A6,Exposure_Hazard!B$17:Q$47,11,FALSE),\"n/a\")","v":3},"n/a",{"$f":"IFERROR(VLOOKUP(A6,'Insurance coverage'!B$18:AD$47,14,FALSE),\"n/a\")","v":4},null,{"$f":"VLOOKUP(A6,'Historical Protection gap'!$A$17:$AC$47,22,FALSE)","v":2},null,{"$f":"IF((AND(ISNUMBER(W6),ISNUMBER(X6))),MROUND((V6)^(1.5/3)*W6^(0.5/3)*X6^(1/3),0.1),IF(ISNUMBER(W6),MROUND((V6)^(1.5/2)*W6^(0.5/2),0.1),MROUND((V6)^(1.5/2.5)*X6^(1/2.5),0.1)))","v":2.6},{"$f":"IFERROR(VLOOKUP(A6,Exposure_Hazard!B$17:T$47,15,FALSE),\"n/a\")","v":2},"n/a",{"$f":"IFERROR(VLOOKUP(A6,'Insurance coverage'!B$18:AD$47,17,FALSE),\"n/a\")","v":4},null,{"$f":"VLOOKUP(A6,'Historical Protection gap'!$A$17:$AC$47,29,FALSE)","v":2},null,{"$f":"IF((AND(ISNUMBER(AD6),ISNUMBER(AE6))),MROUND((AC6)^(1.5/3)*AD6^(0.5/3)*AE6^(1/3),0.1),IF(ISNUMBER(AD6),MROUND((AC6)^(1.5/2)*AD6^(0.5/2),0.1),MROUND((AC6)^(1.5/2.5)*AE6^(1/2.5),0.1)))","v":0},{"$f":"IFERROR(VLOOKUP(A6,Exposure_Hazard!B$17:T$47,19,FALSE),\"n/a\")","v":2},{"$f":"IFERROR(VLOOKUP(A6,Vulnerability!$A$17:$M$47,13,FALSE),\"n/a\")","v":2},{"$f":"IFERROR(VLOOKUP(A6,'Insurance coverage'!B$18:AD$47,28,FALSE),\"n/a\")","v":0},null,0,"no risk"]
["Belgium",{"$f":"MROUND((Z7+S7+L7+E7)/4,0.1)","v":1},{"$f":"MROUND((AB7+U7+N7+G7)/4,0.1)","v":1.7000000000000002},null,{"$f":"VLOOKUP(A7,'Historical Protection gap'!$A$17:$AC$47,8,FALSE)","v":1},null,{"$f":"IF((AND(ISNUMBER(I7),ISNUMBER(J7))),MROUND((H7)^(1.5/3)*I7^(0.5/3)*J7^(1/3),0.1),IF(ISNUMBER(I7),MROUND((H7)^(1.5/2)*I7^(0.5/2),0.1),MROUND((H7)^(1.5/2.5)*J7^(1/2.5),0.1)))","v":1.3},{"$f":"IFERROR(VLOOKUP(A7,Exposure_Hazard!B$17:Q$47,7,FALSE),\"n/a\")","v":1},{"$f":"IFERROR(VLOOKUP(A7,Vulnerability!A$17:F$47,6,FALSE),\"n/a\")","v":4},{"$f":"IFERROR(VLOOKUP(A7,'Insurance coverage'!B$18:AD$47,7,FALSE),\"n/a\")","v":1},null,{"$f":"VLOOKUP(A7,'Historical Protection gap'!$A$17:$AC$47,15,FALSE)","v":1},null,{"$f":"IF((AND(ISNUMBER(P7),ISNUMBER(Q7))),MROUND((O7)^(1.5/3)*P7^(0.5/3)*Q7^(1/3),0.1),IF(ISNUMBER(P7),MROUND((O7)^(1.5/2)*P7^(0.5/2),0.1),MROUND((O7)^(1.5/2.5)*Q7^(1/2.5),0.1)))","v":1.9000000000000001},{"$f":"IFERROR(VLOOKUP(A7,Exposure_Hazard!B$17:Q$47,11,FALSE),\"n/a\")","v":3},"n/a",{"$f":"IFERROR(VLOOKUP(A7,'Insurance coverage'!B$18:AD$47,14,FALSE),\"n/a\")","v":1},null,{"$f":"VLOOKUP(A7,'Historical Protection gap'!$A$17:$AC$47,22,FALSE)","v":1},null,2,{"$f":"IFERROR(VLOOKUP(A7,Exposure_Hazard!B$17:T$47,15,FALSE),\"n/a\")","v":2},"n/a",{"$f":"IFERROR(VLOOKUP(A7,'Insurance coverage'!B$18:AD$47,17,FALSE),\"n/a\")","v":"n/a"},null,{"$f":"VLOOKUP(A7,'Historical Protection gap'!$A$17:$AC$47,29,FALSE)","v":1},null,{"$f":"IF((AND(ISNUMBER(AD7),ISNUMBER(AE7))),MROUND((AC7)^(1.5/3)*AD7^(0.5/3)*AE7^(1/3),0.1),IF(ISNUMBER(AD7),MROUND((AC7)^(1.5/2)*AD7^(0.5/2),0.1),MROUND((AC7)^(1.5/2.5)*AE7^(1/2.5),0.1)))","v":1.6},{"$f":"IFERROR(VLOOKUP(A7,Exposure_Hazard!B$17:T$47,19,FALSE),\"n/a\")","v":2},{"$f":"IFERROR(VLOOKUP(A7,Vulnerability!$A$17:$M$47,13,FALSE),\"n/a\")","v":2},{"$f":"IFERROR(VLOOKUP(A7,'Insurance coverage'!B$18:AD$47,28,FALSE),\"n/a\")","v":1},null,1,"low risk"]
["Bulgaria",1.8,2,null,{"$f":"VLOOKUP(A8,'Historical Protection gap'!$A$17:$AC$47,8,FALSE)","v":1},null,3.2,{"$f":"IFERROR(VLOOKUP(A8,Exposure_Hazard!B$17:Q$47,7,FALSE),\"n/a\")","v":3},{"$f":"IFERROR(VLOOKUP(A8,Vulnerability!A$17:F$47,6,FALSE),\"n/a\")","v":4},{"$f":"IFERROR(VLOOKUP(A8,'Insurance coverage'!B$18:AD$47,7,FALSE),\"n/a\")","v":"n/a"},null,{"$f":"VLOOKUP(A8,'Historical Protection gap'!$A$17:$AC$47,15,FALSE)","v":3},null,1.7000000000000002,{"$f":"IFERROR(VLOOKUP(A8,Exposure_Hazard!B$17:Q$47,11,FALSE),\"n/a\")","v":1},"n/a",{"$f":"IFERROR(VLOOKUP(A8,'Insurance coverage'!B$18:AD$47,14,FALSE),\"n/a\")","v":4},null,{"$f":"VLOOKUP(A8,'Historical Protection gap'!$A$17:$AC$47,22,FALSE)","v":1},null,{"$f":"IF((AND(ISNUMBER(W8),ISNUMBER(X8))),MROUND((V8)^(1.5/3)*W8^(0.5/3)*X8^(1/3),1),IF(ISNUMBER(W8),MROUND((V8)^(1.5/2)*W8^(0.5/2),1),MROUND((V8)^(1.5/2.5)*X8^(1/2.5),1)))","v":2},{"$f":"IFERROR(VLOOKUP(A8,Exposure_Hazard!B$17:T$47,15,FALSE),\"n/a\")","v":1},"n/a",{"$f":"IFERROR(VLOOKUP(A8,'Insurance coverage'!B$18:AD$47,17,FALSE),\"n/a\")","v":4},null,{"$f":"VLOOKUP(A8,'Historical Protection gap'!$A$17:$AC$47,29,FALSE)","v":2},null,1.2000000000000002,{"$f":"IFERROR(VLOOKUP(A8,Exposure_Hazard!B$17:T$47,19,FALSE),\"n/a\")","v":1},{"$f":"IFERROR(VLOOKUP(A8,Vulnerability!$A$17:$M$47,13,FALSE),\"n/a\")","v":2},{"$f":"IFERROR(VLOOKUP(A8,'Insurance coverage'!B$18:AD$47,28,FALSE),\"n/a\")","v":"n/a"},null,2,"low/medium risk"]
["Croatia",2.3000000000000003,2.4000000000000004,null,{"$f":"VLOOKUP(A9,'Historical Protection gap'!$A$17:$AC$47,8,FALSE)","v":2},null,2.8000000000000003,{"$f":"IFERROR(VLOOKUP(A9,Exposure_Hazard!B$17:Q$47,7,FALSE),\"n/a\")","v":2},{"$f":"IFERROR(VLOOKUP(A9,Vulnerability!A$17:F$47,6,FALSE),\"n/a\")","v":4},{"$f":"IFERROR(VLOOKUP(A9,'Insurance coverage'!B$18:AD$47,7,FALSE),\"n/a\")","v":4},null,{"$f":"VLOOKUP(A9,'Historical Protection gap'!$A$17:$AC$47,15,FALSE)","v":3},null,2,{"$f":"IFERROR(VLOOKUP(A9,Exposure_Hazard!B$17:Q$47,11,FALSE),\"n/a\")","v":2},"n/a",{"$f":"IFERROR(VLOOKUP(A9,'Insurance coverage'!B$18:AD$47,14,FALSE),\"n/a\")","v":2},null,{"$f":"VLOOKUP(A9,'Historical Protection gap'!$A$17:$AC$47,22,FALSE)","v":3},null,3,{"$f":"IFERROR(VLOOKUP(A9,Exposure_Hazard!B$17:T$47,15,FALSE),\"n/a\")","v":2},"n/a",{"$f":"IFERROR(VLOOKUP(A9,'Insurance coverage'!B$18:AD$47,17,FALSE),\"n/a\")","v":4},null,{"$f":"VLOOKUP(A9,'Historical Protection gap'!$A$17:$AC$47,29,FALSE)","v":1},null,1.6,{"$f":"IFERROR(VLOOKUP(A9,Exposure_Hazard!B$17:T$47,19,FALSE),\"n/a\")","v":1},{"$f":"IFERROR(VLOOKUP(A9,Vulnerability!$A$17:$M$47,13,FALSE),\"n/a\")","v":2},{"$f":"IFERROR(VLOOKUP(A9,'Insurance coverage'!B$18:AD$47,28,FALSE),\"n/a\")","v":3},null,3,"medium/high risk"]
["Cyprus",1.3,1.9000000000000001,null,{"$f":"VLOOKUP(A10,'Historical Protection gap'!$A$17:$AC$47,8,FALSE)","v":1},null,2.5,{"$f":"IFERROR(VLOOKUP(A10,Exposure_Hazard!B$17:Q$47,7,FALSE),\"n/a\")","v":3},{"$f":"IFERROR(VLOOKUP(A10,Vulnerability!A$17:F$47,6,FALSE),\"n/a\")","v":1},{"$f":"IFERROR(VLOOKUP(A10,'Insurance coverage'!B$18:AD$47,7,FALSE),\"n/a\")","v":3},null,{"$f":"VLOOKUP(A10,'Historical Protection gap'!$A$17:$AC$47,15,FALSE)","v":1},null,1,{"$f":"IFERROR(VLOOKUP(A10,Exposure_Hazard!B$17:Q$47,11,FALSE),\"n/a\")","v":1},"n/a",{"$f":"IFERROR(VLOOKUP(A10,'Insurance coverage'!B$18:AD$47,14,FALSE),\"n/a\")","v":"n/a"},null,{"$f":"VLOOKUP(A10,'Historical Protection gap'!$A$17:$AC$47,22,FALSE)","v":2},null,3,{"$f":"IFERROR(VLOOKUP(A10,Exposure_Hazard!B$17:T$47,15,FALSE),\"n/a\")","v":3},"n/a",{"$f":"IFERROR(VLOOKUP(A10,'Insurance coverage'!B$18:AD$47,17,FALSE),\"n/a\")","v":4},null,{"$f":"VLOOKUP(A10,'Historical Protection gap'!$A$17:$AC$47,29,FALSE)","v":1},null,1,{"$f":"IFERROR(VLOOKUP(A10,Exposure_Hazard!B$17:T$47,19,FALSE),\"n/a\")","v":1},{"$f":"IFERROR(VLOOKUP(A10,Vulnerability!$A$17:$M$47,13,FALSE),\"n/a\")","v":1},{"$f":"IFERROR(VLOOKUP(A10,'Insurance coverage'!B$18:AD$47,28,FALSE),\"n/a\")","v":"n/a"},null,4,"high risk"]
["Czech Republic",1.8,1.9000000000000001,null,{"$f":"VLOOKUP(A11,'Historical Protection gap'!$A$17:$AC$47,8,FALSE)","v":1},null,1.8,{"$f":"IFERROR(VLOOKUP(A11,Exposure_Hazard!B$17:Q$47,7,FALSE),\"n/a\")","v":1},{"$f":"IFERROR(VLOOKUP(A11,Vulnerability!A$17:F$47,6,FALSE),\"n/a\")","v":4},{"$f":"IFERROR(VLOOKUP(A11,'Insurance coverage'!B$18:AD$47,7,FALSE),\"n/a\")","v":3},null,{"$f":"VLOOKUP(A11,'Historical Protection gap'!$A$17:$AC$47,15,FALSE)","v":3},null,2,{"$f":"IFERROR(VLOOKUP(A11,Exposure_Hazard!B$17:Q$47,11,FALSE),\"n/a\")","v":2},"n/a",{"$f":"IFERROR(VLOOKUP(A11,'Insurance coverage'!B$18:AD$47,14,FALSE),\"n/a\")","v":2},null,{"$f":"VLOOKUP(A11,'Historical Protection gap'!$A$17:$AC$47,22,FALSE)","v":2},null,2,{"$f":"IFERROR(VLOOKUP(A11,Exposure_Hazard!B$17:T$47,15,FALSE),\"n/a\")","v":1},"n/a",{"$f":"IFERROR(VLOOKUP(A11,'Insurance coverage'!B$18:AD$47,17,FALSE),\"n/a\")","v":4},null,{"$f":"VLOOKUP(A11,'Historical Protection gap'!$A$17:$AC$47,29,FALSE)","v":1},null,1.6,{"$f":"IFERROR(VLOOKUP(A11,Exposure_Hazard!B$17:T$47,19,FALSE),\"n/a\")","v":2},{"$f":"IFERROR(VLOOKUP(A11,Vulnerability!$A$17:$M$47,13,FALSE),\"n/a\")","v":2},{"$f":"IFERROR(VLOOKUP(A11,'Insurance coverage'!B$18:AD$47,28,FALSE),\"n/a\")","v":1},null,"n/a","not available"]
["Denmark",1.5,0,null,{"$f":"VLOOKUP(A12,'Historical Protection gap'!$A$17:$AC$47,8,FALSE)","v":1},null,0,{"$f":"IFERROR(VLOOKUP(A12,Exposure_Hazard!B$17:Q$47,7,FALSE),\"n/a\")","v":0},{"$f":"IFERROR(VLOOKUP(A12,Vulnerability!A$17:F$47,6,FALSE),\"n/a\")","v":4},{"$f":"IFERROR(VLOOKUP(A12,'Insurance coverage'!B$18:AD$47,7,FALSE),\"n/a\")","v":4},null,{"$f":"VLOOKUP(A12,'Historical Protection gap'!$A$17:$AC$47,15,FALSE)","v":1},null,0,{"$f":"IFERROR(VLOOKUP(A12,Exposure_Hazard!B$17:Q$47,11,FALSE),\"n/a\")","v":1},"n/a",{"$f":"IFERROR(VLOOKUP(A12,'Insurance coverage'!B$18:AD$47,14,FALSE),\"n/a\")","v":0},null,{"$f":"VLOOKUP(A12,'Historical Protection gap'!$A$17:$AC$47,22,FALSE)","v":2},null,0,{"$f":"IFERROR(VLOOKUP(A12,Exposure_Hazard!B$17:T$47,15,FALSE),\"n/a\")","v":1},"n/a",{"$f":"IFERROR(VLOOKUP(A12,'Insurance coverage'!B$18:AD$47,17,FALSE),\"n/a\")","v":0},null,{"$f":"VLOOKUP(A12,'Historical Protection gap'!$A$17:$AC$47,29,FALSE)","v":2},null,0,{"$f":"IFERROR(VLOOKUP(A12,Exposure_Hazard!B$17:T$47,19,FALSE),\"n/a\")","v":4},{"$f":"IFERROR(VLOOKUP(A12,Vulnerability!$A$17:$M$47,13,FALSE),\"n/a\")","v":2},{"$f":"IFERROR(VLOOKUP(A12,'Insurance coverage'!B$18:AD$47,28,FALSE),\"n/a\")","v":0}]
["Estonia",0.5,1.1000000000000001,null,{"$f":"VLOOKUP(A13,'Historical Protection gap'!$A$17:$AC$47,8,FALSE)","v":0},null,0,{"$f":"IFERROR(VLOOKUP(A13,Exposure_Hazard!B$17:Q$47,7,FALSE),\"n/a\")","v":0},{"$f":"IFERROR(VLOOKUP(A13,Vulnerability!A$17:F$47,6,FALSE),\"n/a\")","v":4},{"$f":"IFERROR(VLOOKUP(A13,'Insurance coverage'!B$18:AD$47,7,FALSE),\"n/a\")","v":4},null,{"$f":"VLOOKUP(A13,'Historical Protection gap'!$A$17:$AC$47,15,FALSE)","v":0},null,0,{"$f":"IFERROR(VLOOKUP(A13,Exposure_Hazard!B$17:Q$47,11,FALSE),\"n/a\")","v":1},"n/a",{"$f":"IFERROR(VLOOKUP(A13,'Insurance coverage'!B$18:AD$47,14,FALSE),\"n/a\")","v":0},null,{"$f":"VLOOKUP(A13,'Historical Protection gap'!$A$17:$AC$47,22,FALSE)","v":1},null,3,{"$f":"IFERROR(VLOOKUP(A13,Exposure_Hazard!B$17:T$47,15,FALSE),\"n/a\")","v":2},"n/a",{"$f":"IFERROR(VLOOKUP(A13,'Insurance coverage'!B$18:AD$47,17,FALSE),\"n/a\")","v":4},null,{"$f":"VLOOKUP(A13,'Historical Protection gap'!$A$17:$AC$47,29,FALSE)","v":1},null,1.5,{"$f":"IFERROR(VLOOKUP(A13,Exposure_Hazard!B$17:T$47,19,FALSE),\"n/a\")","v":2},{"$f":"IFERROR(VLOOKUP(A13,Vulnerability!$A$17:$M$47,13,FALSE),\"n/a\")","v":"n/a"},{"$f":"IFERROR(VLOOKUP(A13,'Insurance coverage'!B$18:AD$47,28,FALSE),\"n/a\")","v":1}]
["Finland",1,0.70000000000000007,null,{"$f":"VLOOKUP(A14,'Historical Protection gap'!$A$17:$AC$47,8,FALSE)","v":0},null,0,{"$f":"IFERROR(VLOOKUP(A14,Exposure_Hazard!B$17:Q$47,7,FALSE),\"n/a\")","v":0},{"$f":"IFERROR(VLOOKUP(A14,Vulnerability!A$17:F$47,6,FALSE),\"n/a\")","v":4},{"$f":"IFERROR(VLOOKUP(A14,'Insurance coverage'!B$18:AD$47,7,FALSE),\"n/a\")","v":"n/a"},null,{"$f":"VLOOKUP(A14,'Historical Protection gap'!$A$17:$AC$47,15,FALSE)","v":1},null,1,{"$f":"IFERROR(VLOOKUP(A14,Exposure_Hazard!B$17:Q$47,11,FALSE),\"n/a\")","v":1},"n/a",{"$f":"IFERROR(VLOOKUP(A14,'Insurance coverage'!B$18:AD$47,14,FALSE),\"n/a\")","v":"n/a"},null,{"$f":"VLOOKUP(A14,'Historical Protection gap'!$A$17:$AC$47,22,FALSE)","v":2},null,0,{"$f":"IFERROR(VLOOKUP(A14,Exposure_Hazard!B$17:T$47,15,FALSE),\"n/a\")","v":1},"n/a",{"$f":"IFERROR(VLOOKUP(A14,'Insurance coverage'!B$18:AD$47,17,FALSE),\"n/a\")","v":0},null,{"$f":"VLOOKUP(A14,'Historical Protection gap'!$A$17:$AC$47,29,FALSE)","v":1},null,1.8,{"$f":"IFERROR(VLOOKUP(A14,Exposure_Hazard!B$17:T$47,19,FALSE),\"n/a\")","v":2},{"$f":"IFERROR(VLOOKUP(A14,Vulnerability!$A$17:$M$47,13,FALSE),\"n/a\")","v":4},{"$f":"IFERROR(VLOOKUP(A14,'Insurance coverage'!B$18:AD$47,28,FALSE),\"n/a\")","v":1}]
["France",1.3,0.5,null,{"$f":"VLOOKUP(A15,'Historical Protection gap'!$A$17:$AC$47,8,FALSE)","v":1},null,0,{"$f":"IFERROR(VLOOKUP(A15,Exposure_Hazard!B$17:Q$47,7,FALSE),\"n/a\")","v":1},{"$f":"IFERROR(VLOOKUP(A15,Vulnerability!A$17:F$47,6,FALSE),\"n/a\")","v":4},{"$f":"IFERROR(VLOOKUP(A15,'Insurance coverage'!B$18:AD$47,7,FALSE),\"n/a\")","v":0},null,{"$f":"VLOOKUP(A15,'Historical Protection gap'!$A$17:$AC$47,15,FALSE)","v":1},null,0,{"$f":"IFERROR(VLOOKUP(A15,Exposure_Hazard!B$17:Q$47,11,FALSE),\"n/a\")","v":2},"n/a",{"$f":"IFERROR(VLOOKUP(A15,'Insurance coverage'!B$18:AD$47,14,FALSE),\"n/a\")","v":0},null,{"$f":"VLOOKUP(A15,'Historical Protection gap'!$A$17:$AC$47,22,FALSE)","v":1},null,2,{"$f":"IFERROR(VLOOKUP(A15,Exposure_Hazard!B$17:T$47,15,FALSE),\"n/a\")","v":2},"n/a",{"$f":"IFERROR(VLOOKUP(A15,'Insurance coverage'!B$18:AD$47,17,FALSE),\"n/a\")","v":"n/a"},null,{"$f":"VLOOKUP(A15,'Historical Protection gap'!$A$17:$AC$47,29,FALSE)","v":2},null,0,{"$f":"IFERROR(VLOOKUP(A15,Exposure_Hazard!B$17:T$47,19,FALSE),\"n/a\")","v":1},{"$f":"IFERROR(VLOOKUP(A15,Vulnerability!$A$17:$M$47,13,FALSE),\"n/a\")","v":2},{"$f":"IFERROR(VLOOKUP(A15,'Insurance coverage'!B$18:AD$47,28,FALSE),\"n/a\")","v":0}]
{"$rows_left_out":23}
{"sheet":"Historical Protection gap","index":2,"n_rows":49,"n_cols":29,"rows_kept":49,"cut":false,"hidden":false,"merged":[[15,1,15,7],[15,8,15,14],[15,22,15,28],[15,15,15,21]]}
["HISTORICAL PROTECTION GAP",null,null,null,null,null,null,"Return to Intro tab"]
[]
["Source link","https://www.munichre.com/en/solutions/for-industry-clients/natcatservice.html "]
[null,"https://www.sigma-explorer.com/"]
[null,"https://www.consorseguros.es/web/documents/10184/44193/Estadistica_Riesgos_Extraordinarios_1971_2014/14ca6778-2081-4060-a86d-728d9a17c522"]
["Data ","NATCAT Service MunichRe* (2018 USD values - millions) & Swiss Re Sigma data and Consorcio de Compensación de Seguros CCS for Spain"]
["Time serie","1980-2018 & 1970-2019"]
["Legend"]
[0,"no risk"]
[1,"low risk"]
[2,"low/medium risk"]
[3,"medium/high risk"]
[4,"high risk"]
["n/a","not available"]
[]
{"$rows_left_out":35}
{"sheet":"Exposure_Hazard","index":3,"n_rows":59,"n_cols":20,"rows_kept":59,"cut":false,"hidden":false,"merged":[[15,16,15,19],[15,12,15,15],[53,0,56,4],[58,0,61,7],[48,0,51,8],[15,2,15,7],[15,8,15,11]]}
["HAZARD&EXPOSURE EARTHQUAKE",null,null,null,null,null,null,null,"Return to Intro tab"]
[]
["Source link","https://drmkc.jrc.ec.europa.eu/risk-data-hub/ "]
["Data","RISK DATA HUB"]
[null,"See source below for Earthquake*"]
[null,"See source below for Flood**"]
[null,"See source below for Wildfire***"]
[null,"WISC and ESPON for windstorm"]
["Legend"]
[0,"no risk"]
[1,"low risk"]
[2,"low/medium risk"]
[3,"medium/high risk"]
[4,"high risk"]
["n/a","not available"]
{"$rows_left_out":45}
{"sheet":"Vulnerability","index":4,"n_rows":47,"n_cols":13,"rows_kept":47,"cut":false,"hidden":false,"merged":[[15,2,15,5],[15,6,15,12]]}
["VULNERABILITY",null,"Return to Intro tab"]
[]
["Source link","https://ec.europa.eu/jrc/en/publication/building-stock-inventory-assess-seismic-vulnerability-across-europe-0"]
[null,"https://wisc.climate.copernicus.eu/wisc/#/help/products "]
["Data","Palermo et al. "]
[null,"WISC Copernicus data"]
[]
[]
["Legend"]
[0,"no risk"]
[1,"low risk"]
[2,"low/medium risk"]
[3,"medium/high risk"]
[4,"high risk"]
["n/a","not available"]
{"$rows_left_out":33}
{"sheet":"Insurance coverage","index":5,"n_rows":47,"n_cols":30,"rows_kept":47,"cut":false,"hidden":false,"merged":[[15,2,15,8],[15,9,15,15],[15,16,15,22],[15,23,15,29]]}
["INSURANCE COVERAGE",null,"Return to Intro tab"]
[]
["Source link"]
["Data","NCA’s expert estimations"]
[null,"Hudson et al. 2019; OECD 2016&2018; Insurance Europe; EC 2017; Tesselaar et al. 2020."]
[null,"Policy conditions: Data collected by EIOPA"]
[]
[]
["Legend"]
[0,"no risk"]
[1,"low risk"]
[2,"low/medium risk"]
[3,"medium/high risk"]
[4,"high risk"]
["n/a","not available"]
{"$rows_left_out":33}
{"sheet":"GDP","index":6,"n_rows":41,"n_cols":6,"rows_kept":41,"cut":false,"hidden":false,"merged":[[4,1,4,2],[4,3,4,4]]}
["GDP"]
[]
["Data source: EUROSTAT","https://ec.europa.eu/eurostat/databrowser/view/tec00001/default/table?lang=en "]
["Conversion rate: InforEuro (31.12.2018)",1.1387,"https://ec.europa.eu/info/funding-tenders/how-eu-funding-works/information-contractors-and-beneficiaries/exchange-rate-inforeuro_en "]
["TIME","2018","","2019","","2018 USD"]
["GEO (Labels)","","","",""]
["European Union - 27 countries (from 2020)",13498257.5,null,13939074.5,"",{"$f":"B7*$B$4","v":15370465.81525}]
["European Union - 28 countries (2013-2020)",15921994.1,null,16464167.6,"",{"$f":"B8*$B$4","v":18130374.681669999}]
["Euro area (EA11-1999, EA12-2001, EA13-2007, EA15-2008, EA16-2009, EA17-2011, EA18-2014, EA19-2015)",11571626,null,11920174,"",13176610.5262]
["Euro area - 19 countries  (from 2015)",11571626,null,11920174,"",13176610.5262]
["Belgium",459531.6,null,473085.1,"",523268.63292]
["Bulgaria",56086.9,null,60675.3,"p",63866.153030000001]
["Czech Republic",210892.7,null,223945,"",240143.51749000003]
["Denmark",301340.90000000002,null,310002.3,"",{"$f":"B14*$B$4","v":343136.88283000002}]
["Germany",3356410,null,3449050,"",3821944.0670000003]
{"$rows_left_out":27}
{"sheet":"Country area","index":7,"n_rows":36,"n_cols":3,"rows_kept":36,"cut":false,"hidden":false,"merged":[]}
["COUNTRY AREA"]
[]
["Datasource","Worldmeter","How many countries in Europe? - Worldometer (worldometers.info)"]
[]
[]
["Country","Area (km2)"]
["Austria",83879]
["Belgium",30530]
["Bulgaria",111000]
["Croatia",56590]
["Cyprus",9250]
["Czech Republic",78870]
["Denmark",42920]
["Estonia",45340]
["Finland",338450]
{"$rows_left_out":21}